{"text_format":"1","workbook":"xlsx","n_sheets":13,"sheets":["Menu","Plan de Levage","Site Layout","Type 1","Type 2","Type 3","Recherche Angle","Montage des poulies","Équipements","Exigences de levage","Credits","Sheet2","Sheet1"],"not_rendered":{"charts":1,"images":15,"macros":1,"external_links":0,"defined_names":11,"comments":0,"pivot_tables":0},"unopened":[],"bounds":{"document_bytes":16777216,"sheet_cells":100000,"rows_first":2000,"rows_last":500,"rows_between":2000,"halvings":0,"cell_chars":16384,"cell_head_chars":4096},"cells_cut":0,"cells_raw":0,"read":"whole","date_system":"1900"}

{"sheet":"Menu","index":0,"n_rows":56,"n_cols":27,"rows_kept":56,"cut":false,"hidden":false,"merged":[[17,4,17,6],[14,4,14,6],[17,8,17,9],[9,10,9,12],[10,10,10,12],[11,10,11,12],[12,10,12,12],[13,10,13,12],[12,8,12,9],[13,8,13,9],[14,8,14,9],[15,8,15,9],[16,8,16,9],[10,4,10,6],[7,26,7,30],[11,4,11,6],[9,4,9,6],[15,10,15,12],[14,10,14,12],[9,8,9,9],[10,8,10,9],[11,8,11,9],[12,4,12,6],[13,4,13,6],[8,26,25,30],[8,4,8,6],[8,10,8,12],[7,10,7,12],[8,8,8,9],[7,4,7,6],[52,1,54,13],[0,1,0,7],[1,1,1,7],[2,2,2,4],[2,11,2,13],[3,2,3,4],[3,11,3,13],[19,10,19,12],[16,10,16,12],[17,10,17,12],[18,10,18,12],[4,2,4,4],[4,5,4,9],[4,11,4,13],[6,4,6,5],[6,7,6,9]]}
[]
[]
[null,"Contact","Gordon Lyman",null,null,null,null,null,null,null,null,"Bill Griswold"]
[null,"Email","gl@esystemtraining.com ",null,null,null,null,null,null,null,null,"BillGriswold@Live.com"]
[null,"Mobile No"," (210) 410-2091",null,null,"Menu de Configuration",null,null,null,null,null,"(704) 906-9113"]
[]
[null,null,null,null,"Note: Champs en",null,"Bleu","sont pour les entrées",null,null,null,null,null,null,null,null,"Oui",null,null,null,null,null,null,null,"Monopole Tower"]
[null,null,null,null,"Information Project",null,null,null,null,null,"Info Entrepreneur",null,null,null,null,null,"Non",null,null,null,null,null,null,null,"Guyed Tower",null,"Procedures d'utilisation"]
[null,"Date: mm/jj",null,null,null,null,null,null,"Compagnie",null,null,null,null,null,null,null,null,null,null,null,null,null,null,null,null,null,"1 - Mettre les informations sur le projet et l'entrepreneur dans les cellules appropriees a gauche Cette information apparaitra dans le \"plan de montage\".\n2 - La charge levee devrait inclure le poids de la boule de maux de tete ou autre equipment de fixation dans la cellule \"charge a lever\".\n3 - Selectionnez les poulies et les cabestans a utiliser pour le projet. (Voir l'onglet Equipement pour la liste)\n4 - Selectionnez le type de schema de levage (1,2 ou 3)\n5 - Sur la feuille Type de levage Selectionnez le type de tour et remplissez les cellules indiquees en BLEU. Toutes les informations de chargement et d'equipements apparaissent sur les 3 types de levage\n6 - Les boutons permettent une navigation facile entre les feuilles differentes.\n7 - Pour de plus amples instructions, voir les onglets \"Plan de levage\" \" Montage de tete\" et \"Equipements\"."]
[null,"Client ",null,null,null,null,null,null,"Adresse"]
[null,"No Commande Client",null,null,null,null,null,null,"Ville, Province",null,null,null,null,null,null,null,"Distance",null,null,null,null,null,null,null,"YES"]
[null,"Nom du Site",null,null,null,null,null,null,"Contact",null,null,null,null,null,null,null,"Angle"]
[null,"# Site",null,null,null,null,null,null,"No Telephone"]
[null,"Adresse Site",null,null,null,null,null,null,"Monteur Certifié"]
[null,"Ville, Province",null,null,null,null,null,null,"# Project",null,null,null,null,null,null,null,null,null,{"$f":"VLOOKUP(K17,Équipements!B23:C34,2,FALSE)","v":5000}]
{"$rows_left_out":42}
{"sheet":"Plan de Levage","index":1,"n_rows":65,"n_cols":20,"rows_kept":65,"cut":false,"hidden":false,"merged":[[0,5,0,9],[1,5,1,9],[2,5,2,9],[3,5,3,9],[4,5,4,9],[10,13,10,14],[21,12,21,13],[20,12,20,14],[17,6,17,7],[16,8,16,9],[17,8,17,9],[15,8,15,9],[0,19,4,21],[5,0,5,6],[42,13,43,13],[42,16,43,16],[42,14,43,14],[42,15,43,15],[42,17,43,17],[42,18,43,18],[19,0,19,9],[20,0,20,1],[21,0,21,1],[20,2,20,4],[20,5,20,7],[21,5,21,7],[20,8,20,9],[5,7,5,9],[21,8,21,9],[31,0,31,1],[16,3,16,5],[17,3,17,5],[16,6,16,7],[24,12,24,13],[12,11,12,12],[29,0,29,3],[58,0,58,9],[44,0,44,1],[44,3,44,4],[44,6,44,8],[46,0,46,9],[45,0,45,1],[45,3,45,4],[45,6,45,8],[30,0,30,9],[35,0,35,1],[32,0,32,1],[36,0,36,1],[37,0,37,1],[35,3,35,4],[36,3,36,4],[37,3,37,4],[35,6,35,8],[36,6,36,8],[37,6,37,8],[43,6,43,8],[47,0,47,1],[47,3,47,4],[48,4,48,5],[48,7,48,9],[29,5,29,6],[29,7,29,8],[22,0,22,9],[23,0,23,3],[23,5,23,8],[59,0,59,9],[51,0,51,9],[52,0,52,1],[53,0,53,1],[52,3,52,4],[53,3,53,4],[52,6,52,8],[53,6,53,8],[56,0,56,9],[57,0,57,9],[54,0,54,9],[55,0,55,9],[47,6,47,8],[33,0,33,1],[40,0,40,9],[38,0,38,1],[38,3,38,4],[38,6,38,8],[28,0,28,3],[9,0,10,1],[12,0,12,1],[10,5,10,6],[11,5,11,6],[10,7,10,9],[11,7,11,9],[10,2,10,4],[11,2,11,4],[6,0,6,9],[7,0,7,1],[8,0,8,1],[7,5,7,6],[8,5,8,6],[9,5,9,6],[7,7,7,9],[8,7,8,9],[9,7,9,9],[7,2,7,4],[8,2,8,4],[9,2,9,4],[12,5,12,6],[11,0,11,1],[12,2,12,4],[12,7,12,9],[26,0,26,3],[24,5,24,8],[25,5,25,8],[26,5,26,8],[18,0,18,1],[18,4,18,9],[18,2,18,3],[16,0,16,2],[17,0,17,2],[15,0,15,2],[14,8,14,9],[14,6,14,7],[14,3,14,5],[14,0,14,2],[15,3,15,5],[15,6,15,7],[21,2,21,3],[25,0,25,3],[24,0,24,3],[33,7,33,8],[31,3,31,5],[61,2,63,7],[61,0,63,1],[61,8,63,9],[0,0,4,4],[32,3,32,5],[33,3,33,5],[32,7,32,8],[31,7,31,8],[39,0,39,1],[39,3,39,4],[39,6,39,8],[60,0,60,9],[41,4,41,5],[41,0,41,3],[41,6,41,9],[34,0,34,9],[49,0,49,9],[50,0,50,9],[42,0,42,9],[43,0,43,1],[43,3,43,4],[13,2,13,3]]}
["Cdler votre logo dans cette section",null,null,null,null,{"$f":"Menu!K9","v":0},null,null,null,null,null,null,null,null,null,null,null,null,null,"Pour mettre votre logo sur le plan de levage copier le dans powerpoit et faire un copier coller dans le coin superieur gauche de la feuille."]
[null,null,null,null,null,{"$f":"Menu!K10","v":0}]
[null,null,null,null,null,{"$f":"Menu!K11","v":0}]
[null,null,null,null,null,{"$f":"\"Contact - \"&Menu!K12","v":"Contact - "}]
[null,null,null,null,null,{"$f":"Menu!K13","v":0}]
["Plan de Levage",null,null,null,null,null,null,"Couleur sont les Entrees"]
["Information Projet "]
["Nom du Site",null,{"$f":"Menu!E12","v":0},null,null,"Date",null,{"$f":"Menu!E9","v":"00:00:00"}]
["# Site",null,{"$f":"Menu!E13","v":0},null,null,"Client",null,{"$f":"Menu!E10","v":0},null,null,null,null,null,null,null,"Class I"]
["Adresse du Site",null,{"$f":"Menu!E14","v":0},null,null,"Projet de Client",null,{"$f":"Menu!E11","v":0},null,null,null,null,null,null,null,"Class II"]
[null,null,{"$f":"Menu!E15","v":0},null,null,"Latitude",null,{"$f":"Menu!E16&\" Deg \"&Menu!F16&\" Min \"&Menu!G16&\" Sec\"","v":"33 Deg 30 Min 14.08 Sec"},null,null,null,null,null,"Engr May Be Req'd",null,"Class III"]
["# Projet",null,{"$f":"Menu!K15","v":0},null,null,"Longitude",null,{"$f":"Menu!E17&\" Deg \"&Menu!F17&\" Min \"&Menu!G17&\" Sec\"","v":"-86 Deg 49 Min 18.44 Sec"},null,null,null,null,null,"E27",{"$f":"IF(E27=\"X\",1,0)","v":0},"Class IV"]
["Classe de Levage",null,{"$f":"IF(Menu!E18=\"Oui\",\"Class IV\",IF(M20>0,\"Class IV\",M24))","v":"Class I"},null,null,"Max. Load (lbs)",null,{"$f":"Menu!K16","v":200},null,null,null,"Engr Req'd",null,"E24",{"$f":"IF(E24=\"X\",1,0)","v":0}]
[null,null,null,null,"Lbs.",null,null,null,null,null,null,null,{"$f":"IF(E31=\"X\",1,0)","v":0}]
["Personne Responsable",null,null,"Nom",null,null,"Compagnie",null,"Telephone",null," ","E26",{"$f":"IF(E26=\"X\",1,0)","v":0},"E29",{"$f":"IF(E29=\"X\",1,0)","v":0},"Monopole"]
{"$rows_left_out":51}
{"sheet":"Site Layout","index":2,"n_rows":0,"n_cols":0,"rows_kept":0,"cut":false,"hidden":true,"merged":[]}

{"sheet":"Type 1","index":3,"n_rows":57,"n_cols":35,"rows_kept":57,"cut":false,"hidden":false,"merged":[[4,10,4,17],[6,17,6,18],[53,1,55,23],[21,9,21,10],[39,8,39,9],[35,2,37,2],[41,12,41,13],[48,21,48,22],[44,21,44,22],[39,21,39,22],[42,12,42,13],[47,11,47,12],[38,15,38,16],[25,13,25,14],[7,6,7,12],[8,6,8,12],[9,6,9,12],[6,19,6,22],[6,12,6,16],[18,14,18,20],[19,14,19,21],[12,13,12,19],[10,6,10,12],[11,6,11,12],[12,6,12,12],[20,14,20,15],[21,14,21,20],[22,9,23,12],[13,16,16,20],[14,6,14,12],[13,6,13,12],[51,1,52,23],[20,16,20,18],[36,7,36,8],[33,12,33,13],[27,14,29,19],[33,15,36,20],[22,16,22,18],[25,11,25,12],[22,22,24,22],[45,11,45,12],[50,1,50,4],[39,19,39,20],[23,14,23,21],[47,17,47,18],[44,18,44,19],[34,12,35,14]]}
[]
[]
[null,"Contact",null,null,"Gordon Lyman",null,null,null,null,null,null,null,null,null,null,null,null,null,null,null,null,null,"Bill Griswold"]
[null,"Email",null,"gl@esystemtraining.com ",null,null,null,null,null,null,null,null,null,null,null,null,null,null,null,null,null,null,"BillGriswold@Live.com"]
[null,"Mobile No",null,null," (210) 410-2091",null,null,null,null,null,"Poulie de Tête Avec Cable de Retenu",null,null,null,null,null,null,null,null,null,null,null,"(704) 906-9113"]
[]
[null,null,null,null,null,null,"Information Projet",null,null,null,null,null,"Note: Champs en ",null,null,null,null,"Bleu",null," sont les entrées",null,null,null,null,null,null,null,null,null,null,null,null,null,null,"Tour Monopole"]
[null,"Date:",null,null,null,null,{"$f":"Menu!E9","v":"00:00:00"},null,null,null,null,null,null,null,null,null,null,null,null,null,null,null,null,null,null,null,null,null,null,null,null,null,null,null,"Tour Autoportante"]
[null,"Entrepreneur",null,null,null,null,{"$f":"Menu!K9","v":0},null,null,null,null,null,null,null,null,null,null,null,null,null,null,null,null,null,null,null,null,null,null,null,null,null,null,null,"Tour Haubannée"]
[null,"# Projet",null,null,null,null,{"$f":"Menu!K15","v":0}]
[null,"Monteur certifie",null,null,null,null,{"$f":"Menu!K14","v":0}]
[null,"Client",null,null,null,null,{"$f":"Menu!E10","v":0}]
[null,"Nom du site",null,null,null,null,{"$f":"Menu!E12","v":0}]
[null,"# Site",null,null,null,null,{"$f":"Menu!E13","v":0},null,null,null,null,null,null,null,null,null,{"$f":"IF(AB21>AB34,\"WARNING - LOAD ANGLE EXCEEDS MAXIMUM!\",\"\")","v":""}]
[null,"Type de tour",null,null,null,null,"Tour Autoportante"]
{"$rows_left_out":43}
{"sheet":"Type 2","index":4,"n_rows":55,"n_cols":23,"rows_kept":55,"cut":false,"hidden":false,"merged":[[49,1,51,11],[52,1,53,11],[12,7,12,10],[12,4,12,6],[46,3,46,7],[20,8,22,8],[18,8,19,8],[23,8,35,8],[34,6,40,7],[21,5,22,6],[39,4,40,5],[41,4,41,7],[14,9,14,11],[14,4,14,6],[19,9,19,11],[15,8,15,11],[0,1,0,7],[1,1,1,7],[13,4,13,6],[3,9,3,11],[4,9,4,11],[7,4,7,6],[9,4,9,6],[10,4,10,6],[11,4,11,6],[8,4,8,6],[2,9,2,11],[2,2,2,4],[3,2,3,4],[4,2,4,4],[9,7,11,10],[4,5,4,8]]}
[]
[]
[null,"Contact","Gordon Lyman",null,null,null,null,null,null,"Bill Griswold"]
[null,"Email","gl@esystemtraining.com ",null,null,null,null,null,null,"BillGriswold@Live.com"]
[null,"Mobile No"," (210) 410-2091",null,null,"Poulie de tête avec Messager",null,null,null,"(704) 906-9113"]
[]
[null,null,null,null,"Information Projet:",null,null,"Note champs en ",null,"Bleu"," sont les entrees.",null,null,null,null,null,null,null,null,null,null,null,"Tour Monopole"]
[null,"Date:",null,null,{"$f":"Menu!E9","v":"00:00:00"},null,null,null,null,null,null,null,null,null,null,null,null,null,null,null,null,null,"Tour Autoportante"]
[null,"Entrepreur:",null,null,{"$f":"Menu!K9","v":0},null,null,null,null,null,null,null,null,null,null,null,null,null,null,null,null,null,"Tour Haubannée"]
[null,"# Projet:",null,null,{"$f":"Menu!K15","v":0}]
[null,"Monteur Certifie:",null,null,{"$f":"Menu!K14","v":0}]
[null,"Client:",null,null,{"$f":"Menu!E10","v":0}]
[null,"Nom du Site:",null,null,{"$f":"Menu!E12","v":0}]
[null,"# Site:",null,null,{"$f":"Menu!E13","v":0},null,null,null,null,null,null,null,null,null,null,null,null,null,null,"Y = ",100]
[null,"Type de Tour:",null,null,"Tour Haubannée",null,null,null,null,"Notes pour L'ingenieur:",null,null,null,null,null,null,null,null,null,"αᵒ","X1","Y2"]
{"$rows_left_out":41}
{"sheet":"Type 3","index":5,"n_rows":57,"n_cols":25,"rows_kept":57,"cut":false,"hidden":false,"merged":[[40,12,41,13],[46,12,47,13],[51,1,52,13],[53,1,55,13],[0,1,0,7],[1,1,1,7],[2,2,2,4],[3,2,3,4],[3,11,3,13],[2,11,2,13],[4,11,4,13],[25,10,26,10],[17,11,17,13],[14,8,16,10],[27,6,29,9],[4,2,4,4],[32,11,35,12],[19,6,19,7],[24,6,24,7],[12,4,12,6],[13,4,13,6],[12,7,12,11],[20,4,21,5],[20,11,20,13],[22,11,22,13],[39,4,40,5],[4,5,4,10],[45,8,46,9],[47,8,47,10],[7,4,7,6],[8,4,8,6],[9,4,9,6],[10,4,10,6],[11,4,11,6],[9,7,11,11],[18,11,18,13],[37,7,38,7],[47,6,47,7],[25,6,25,7],[14,4,14,6],[21,6,23,9]]}
[]
[]
[null,"Contact","Gordon Lyman",null,null,null,null,null,null,null,null,"Bill Griswold"]
[null,"Email","gl@esystemtraining.com ",null,null,null,null,null,null,null,null,"BillGriswold@Live.com"]
[null,"Mobile No"," (210) 410-2091",null,null,"Poulie de tête et de basse avec Tag",null,null,null,null,null,"(704) 906-9113"]
[]
[null,null,null,null,"Information Projet:",null,null,null,"Note: Champs en","Bleu","sont les entrées.",null,null,null,null,null,null,null,null,null,null,null,null,null,"Tour Monopole"]
[null,"Date:",null,null,{"$f":"Menu!E9","v":"00:00:00"},null,null,null,null,null,null,null,null,null,null,null,null,null,null,null,null,null,null,null,"Tour Autoportante"]
[null,"Entrepreneur:",null,null,{"$f":"Menu!K9","v":0},null,null,null,null,null,null,null,null,null,null,null,null,null,null,null,null,null,null,null,"Tour Haubannée"]
[null,"# projet:",null,null,{"$f":"Menu!K15","v":0}]
[null,"Monteur certifie:",null,null,{"$f":"Menu!K14","v":0}]
[null,"Client:",null,null,{"$f":"Menu!E10","v":0},null,null,null,null,null,null,null,null,null,null,null,"Distance"]
[null,"Nom du site:",null,null,{"$f":"Menu!E12","v":0},null,null,null,null,null,null,null,null,null,null,null,"Angle"]
[null,"# Site:",null,null,{"$f":"Menu!E13","v":0},null,null,null,null,null,null,null,null,null,null,null,{"$f":"L16","v":"Distance"}]
[null,"Type de Tour:",null,null,"Tour Haubannée",null,null,null,"Choisir angle de levageou ecartement"]
{"$rows_left_out":43}
{"sheet":"Recherche Angle","index":6,"n_rows":57,"n_cols":25,"rows_kept":57,"cut":false,"hidden":false,"merged":[[0,1,0,7],[1,1,1,7],[2,2,2,4],[2,11,2,13],[3,2,3,4],[3,11,3,13],[12,4,12,6],[12,7,12,11],[13,4,13,6],[4,2,4,4],[4,11,4,13],[7,4,7,6],[8,4,8,6],[9,4,9,6],[10,4,10,6],[11,4,11,6],[4,5,4,9],[14,4,14,6],[53,1,55,13],[13,8,16,11],[24,10,26,10],[51,1,52,13],[24,6,24,7],[22,6,22,7]]}
[]
[]
[null,"Contact","Gordon Lyman",null,null,null,null,null,null,null,null,"Bill Griswold"]
[null,"Email","gl@esystemtraining.com ",null,null,null,null,null,null,null,null,"BillGriswold@Live.com"]
[null,"Mobile No"," (210) 410-2091",null,null,"Outil de recherche d'angles",null,null,null,null,null,"(704) 906-9113"]
[]
[null,null,null,null,"Information Projet:",null,null,null,"Note: Champs en","Bleu","sont les entrees.",null,null,null,null,null,null,null,null,null,null,null,null,null,"Tour Monopole"]
[null,"Date:",null,null,{"$f":"Menu!E9","v":"00:00:00"},null,null,null,null,null,null,null,null,null,null,null,null,null,null,null,null,null,null,null,"Tour Autoportante"]
[null,"Entrepreneur:",null,null,{"$f":"Menu!K9","v":0},null,null,null,null,null,null,null,null,null,null,null,null,null,null,null,null,null,null,null,"Tour Haubannée"]
[null,"# Projet:",null,null,{"$f":"Menu!K15","v":0}]
[null,"Monteur certifie:",null,null,{"$f":"Menu!K14","v":0}]
[null,"Client:",null,null,{"$f":"Menu!E10","v":0},null,null,null,null,null,null,null,null,null,null,null,"Distance"]
[null,"Nom du site:",null,null,{"$f":"Menu!E12","v":0},null,null,null,null,null,null,null,null,null,null,null,"Angle"]
[null,"# Site:",null,null,{"$f":"Menu!E13","v":0},null,null,null,{"$f":"IF(R21>R31,\"WARNING - LOAD ANGLE EXCEEDS MAXIMUM!\",\"\")","v":""}]
[null,"Type de tour:",null,null,"Tour Autoportante"]
{"$rows_left_out":43}
{"sheet":"Montage des poulies","index":7,"n_rows":56,"n_cols":28,"rows_kept":56,"cut":false,"hidden":false,"merged":[[27,6,27,12],[0,1,0,13],[1,1,1,13],[2,4,2,6],[20,6,20,12],[21,6,21,12],[3,3,3,7],[4,8,4,17],[23,16,23,23],[24,15,24,23],[22,19,22,21],[27,19,27,21],[25,2,25,22],[19,6,19,12],[4,20,4,23],[7,6,7,12],[2,27,3,27],[18,19,18,21],[17,2,17,22],[10,6,10,12],[11,6,11,12],[12,6,12,12],[13,6,13,12],[15,6,15,12],[2,20,2,23],[3,20,3,23],[18,6,18,12],[2,26,3,26],[13,15,16,23],[9,6,9,12],[14,6,14,12],[4,4,4,6],[8,6,8,12],[26,19,26,21],[19,19,19,21],[20,19,20,21],[21,19,21,21],[26,6,26,12],[52,1,54,23],[49,1,51,23],[28,19,28,21],[29,19,29,21],[31,16,31,23],[32,15,32,23],[28,6,28,12],[29,6,29,12],[30,19,30,21]]}
[]
[]
[null,"Contact",null,null,"Gordon Lyman",null,null,null,null,null,null,null,null,null,null,null,null,null,null,null,"Bill Griswold",null,null,null,null,null,"Crown\nBlock Load","Heel\nBlock Load"]
[null,"Email",null,"gl@esystemtraining.com ",null,null,null,null,null,null,null,null,null,null,null,null,null,null,null,null,"BillGriswold@Live.com",null,null,null,null,"Type"]
[null,"Mobile No",null,null," (210) 410-2091",null,null,null,"Montage poulies de tête et de basse sur face",null,null,null,null,null,null,null,null,null,null,null,"(704) 906-9113",null,null,null,null,"Type 1",{"$f":"'Type 1'!J22","v":715.93396153062133}]
[null,null,null,null,null,null,null,null,null,null,null,null,null,null,null,null,null,null,null,null,null,null,null,null,null,"Type 2",{"$f":"'Type 2'!G21","v":400}]
[null,null,null,null,null,null,"Information Projet:",null,null,null,null,null,null,null,null,null,null,null,null,null,null,null,null,null,null,"Type 3",{"$f":"'Type 3'!G20","v":488.02526032036855},{"$f":"'Type 3'!E46","v":345.46274173885445}]
[null,"Date:",null,null,null,null,{"$f":"Menu!E9","v":"00:00:00"}]
[null,"Entrepreneur:",null,null,null,null,{"$f":"Menu!K9","v":0},null,null,null,null,null,null,null,null,null,null,null,null,null,null,null,null,null,null,{"$f":"'Type 1'!G15","v":"Tour Autoportante"}]
[null,"# Projet:",null,null,null,null,{"$f":"Menu!K15","v":0},null,null,null,null,null,null,null,null,null,null,null,null,null,null,null,null,null,null,{"$f":"'Type 2'!E15","v":"Tour Haubannée"}]
[null,"Monteur certifie:",null,null,null,null,{"$f":"Menu!K14","v":0},null,null,null,null,null,null,null,null,null,null,null,null,null,null,null,null,null,null,{"$f":"'Type 3'!E15","v":"Tour Haubannée"}]
[null,"Client:",null,null,null,null,{"$f":"Menu!E10","v":0}]
[null,"Nom du site:",null,null,null,null,{"$f":"Menu!E12","v":0},null,null,null,null,null,null,null,null,null,null,null,null,null,null,null,null,null,null,"Panier"]
[null,"# Site:",null,null,null,null,{"$f":"Menu!E13","v":0},null,null,null,null,null,null,null,null,{"$f":"IF(G15=\"Tour Monopole\",\"WARNING - This Page Not Applicable to Monopoles\",\"\")","v":""},null,null,null,null,null,null,null,null,null,"Étranglement"]
[null,"Type de Tour:",null,null,null,null,{"$f":"IF(Z16=\"Type 1\",Z9,IF(Z16=\"Type 2\",Z10,IF(Z16=\"Type 3\",Z11,\"\")))","v":"Tour Haubannée"},null,null,null,null,null,null,{"$f":"IF(G15=\"Monopole Tower\",\"<----\",\"\")","v":""}]
{"$rows_left_out":42}
{"sheet":"Équipements","index":8,"n_rows":46,"n_cols":11,"rows_kept":46,"cut":false,"hidden":false,"merged":[[29,8,29,9],[30,4,30,5],[30,6,30,7],[30,8,30,9],[31,4,31,5],[31,6,31,7],[43,1,44,10],[4,3,4,7],[2,8,2,10],[3,8,3,10],[4,8,4,10],[28,4,28,5],[28,6,28,7],[28,8,28,9],[29,4,29,5],[29,6,29,7],[37,6,37,7],[37,8,37,9],[38,4,38,5],[38,6,38,7],[38,8,38,9],[35,4,35,5],[0,1,0,8],[1,1,1,8],[27,4,27,5],[27,6,27,7],[27,8,27,9],[7,4,7,9],[8,4,26,9],[41,4,41,5],[41,6,41,7],[41,8,41,9],[34,4,34,5],[34,6,34,7],[34,8,34,9],[39,4,39,5],[39,6,39,7],[39,8,39,9],[37,4,37,5],[36,6,36,7],[36,8,36,9],[40,4,40,5],[40,6,40,7],[40,8,40,9],[35,6,35,7],[35,8,35,9],[36,4,36,5],[31,8,31,9],[32,4,32,5],[32,6,32,7],[32,8,32,9],[33,4,33,5],[33,6,33,7],[33,8,33,9]]}
[]
[]
[null,"Contact","Gordon Lyman",null,null,null,null,null,"Bill Griswold"]
[null,"Email","gl@esystemtraining.com ",null,null,null,null,null,"BillGriswold@Live.com"]
[null,"Mobile No"," (210) 410-2091","List des équipements de l'entrepreneur",null,null,null,null,"(704) 906-9113"]
[]
[]
[null,"Hoist Name","Working Capacity (Pounds)",null,"Directions"]
[null,"Hoist 1 - 1000",1000,null,"Faites la liste de tous les palans, blocs et élingues applicables dans les colonnes appropriées. Si vous avez plusieurs palans, poulies ou élingues identiques, ne les lister qu'une seule fois. Fournir également la capacité de travail nominale pour chacun de ceux-ci et la longueur des élingues. Assurez-vous de sauvegarder une copie maîtresse de cette feuille de calcul une fois que cette information a été saisie afin de ne pas avoir à ressaisir les informations chaque fois que vous l'utilisez.\nLorsque vous démarrez un nouveau plan de levage, choisissez le (s) palan (s) et le (s) poulie (s) sur la feuille de menu en utilisant les boîtes déroulantes situées juste en dessous de la cellule d'entrée de charge soulevée. Les noms de ces pièces d'équipement apparaîtront sur les feuilles du plan de gréement de types 1, 2 et 3. Si la capacité de l'un de ces équipements est dépassée, un avertissement apparaîtra dans les LETTRES ROUGES adjacentes à l’équipement\n"]
[null,"Hoist 2 - 1500",1500]
[null,"Hoist 3 - 2000",2000]
[null,"Hoist 4 - 5000",5000]
[]
[]
[]
{"$rows_left_out":32}
{"sheet":"Exigences de levage","index":9,"n_rows":0,"n_cols":0,"rows_kept":0,"cut":false,"hidden":false,"merged":[]}

{"sheet":"Credits","index":10,"n_rows":17,"n_cols":2,"rows_kept":17,"cut":false,"hidden":false,"merged":[[10,1,10,3]]}
[]
["The Equation Development, Drafting and Primary Spreadsheet by William A. Griswold, Jr., PE "]
["Griswold Tower Software, PC"]
[]
["Overview and Editing provided by Gordon Lyman"]
["eSystem Training Solutions"]
[]
["Additional Macro Development provided by James M. Ruedlinger, PE"]
["Electronics Research, Inc."]
[]
["Version","French Version 1.0 - January 11, 2018"]
[]
[4.2,"Formatting Improvements"]
[4.3,"Corrected problems with dropdown boxes on the Face Block Mount Tab"]
[4.4000000000000004,"Added Note to Engineer - Reactions do not include an Impact Factor - Fixed \"Angle\" or \"Distance\" dropdown on Type 3 tab."]
{"$rows_left_out":3}
{"sheet":"Sheet2","index":11,"n_rows":7,"n_cols":10,"rows_kept":7,"cut":false,"hidden":true,"merged":[[1,2,36,4]]}
[]
[null,null,{"$f":"IF(J7=\"Monopole Tower\",\"MP_PIC\",1)","v":"MP_PIC"}]
[null,null,null,null,null,null,null,null,null,"Monopole Tower"]
[null,null,null,null,null,null,null,null,null,"Self Support Tower"]
[null,null,null,null,null,null,null,null,null,"Guyed Tower"]
[]
[null,null,null,null,null,null,null,null,null,"Monopole Tower"]

{"sheet":"Sheet1","index":12,"n_rows":16,"n_cols":8,"rows_kept":16,"cut":false,"hidden":true,"merged":[]}
[]
[]
[]
[null,null,null,null,null,null,"X1","Y2"]
[null,"Alpha = ",7,null,null,null,2E-3,100]
[null,"Beta =",30,null,null,null,2.476,90]
[null,"Load =",300,null,null,null,5.2160000000000002,80]
[null,null,null,null,null,null,8.2650000000000006,70]
[null,"tan(Alpha) = ",{"$f":"TAN(C5*PI()/180)","v":0.1227845609029046},null,null,null,11.683999999999999,60]
[null,"tan(Alpha/2) =",{"$f":"TAN(C5*PI()/360)","v":6.1162620150484306E-2},null,null,null,15.555999999999999,50]
[null,"tan(Beta) = ",{"$f":"TAN(C6*PI()/180)","v":0.57735026918962573},null,null,null,20,40]
[null,null,null,null,null,null,25.192,30]
[null,null,{"$f":"C7*C9","v":36.835368270871378},null,null,null,31.422999999999998,20]
[null,null,{"$f":"C13*C10","v":2.2529476376545081},null,null,null,39.234999999999999,10]
[null,null,{"$f":"C7*(1 - C9*C10)","v":297.74705236234547},null,null,null,50,0]
{"$rows_left_out":1}