{"text_format":"1","workbook":"xlsx","n_sheets":16,"sheets":["Menu Sheet","Rigging Plan","Site Layout","Type 1","Type 2","Type 3","Angle Chart","Face Block Mount","Equipment","Contacts","Rope Chart","Extra Sequence Sheet","Rigging requirements","Credits","Sheet2","Sheet1"],"not_rendered":{"charts":1,"images":15,"macros":1,"external_links":0,"defined_names":12,"comments":0,"pivot_tables":0},"unopened":[],"bounds":{"document_bytes":16777216,"sheet_cells":100000,"rows_first":2000,"rows_last":500,"rows_between":2000,"halvings":0,"cell_chars":16384,"cell_head_chars":4096},"cells_cut":0,"cells_raw":0,"read":"whole","date_system":"1900"}

{"sheet":"Menu Sheet","index":0,"n_rows":56,"n_cols":27,"rows_kept":56,"cut":false,"hidden":false,"merged":[[18,8,18,9],[35,26,37,30],[8,8,8,9],[9,10,9,12],[10,10,10,12],[23,16,23,17],[23,18,23,19],[23,20,23,21],[22,16,22,17],[22,18,22,19],[17,4,17,6],[14,4,14,6],[11,10,11,12],[12,10,12,12],[13,10,13,12],[17,8,17,9],[17,10,17,12],[12,8,12,9],[13,8,13,9],[14,8,14,9],[16,8,16,9],[53,1,54,13],[11,4,11,6],[9,4,9,6],[16,10,16,12],[14,10,14,12],[21,10,21,12],[18,10,18,12],[19,10,19,12],[20,10,20,12],[9,8,9,9],[10,8,10,9],[11,8,11,9],[12,4,12,6],[13,4,13,6],[10,4,10,6],[19,8,19,9],[5,26,6,30],[15,8,15,9],[15,10,15,12],[0,1,0,7],[1,1,1,7],[2,2,2,4],[2,11,2,13],[3,2,3,4],[3,11,3,13],[4,2,4,4],[4,5,4,9],[4,11,4,13],[8,4,8,6],[8,10,8,12],[7,10,7,12],[7,26,34,30]]}
[]
[]
[null,"Contact","Gordon Lyman",null,null,null,null,null,null,null,null,"Bill Griswold"]
[null,"Email","gl@esystemtraining.com ",null,null,null,null,null,null,null,null,"BillGriswold@Live.com"]
[null,"Mobile No"," (210) 410-2091",null,null,"Project Setup Menu",null,null,null,null,null,"(704) 906-9113"]
[null,null,null,null,null,null,null,null,null,null,null,null,null,null,null,null,null,null,null,null,null,null,null,null,null,null,"Directions"]
[null,null,null,null,null,"Note: Fields in","Blue","are for input.",null,null,null,null,null,null,null,null,"Yes"]
[null,null,null,null,"Project Information:",null,null,null,null,null,"Contractor Info:",null,null,null,null,null,"No",null,null,null,null,null,null,null,null,null,"1 - Put the Project Information and the Contractor\n     Information into the appropiate cells to the left.\n     This information will appear in the \"Rigging Plan\".\n2 - The Lats and Longs can either be input as Degrees,\n      Minutes and Seconds, or in decimal format in\n      the Degree input cell.  If input in decimal format\n      the numbers in the Min and Sec cells are ignored.\n3 - To ensure the total load lift is attained, the \n      actual load goes into the \"Lifted Load\" cell  and \n      the rigging accessories and overhaul ball go into \n      the \"Ball & Rigging\" cell.\n4 - The weight of the cables and the friction in the\n      sheaves are automatically calculated and \n      included in the forces.\n5 - It is critical that the equipment tab be filled out \n      with your equipment and capacities, then make\n      your selections (See the Equipment Tab for Listing)\n6 - Select the Type of Rigging Scheme (1, 2, or 3) \n      or the Angle Finder by pressing the button \n      under the picture.\n7 - On the Rigging Type Sheet Select the Tower Type\n      and fill in the dimension blocks outlined in BLUE.\n      All of the loading and equipment information\n      will appear on all 3 Lift Types.\n8 - On the Type I and Type III Lift Types you may \n      select either 1, 2 or 3 line parts between the \n      Crown Block and the Load.\n9 - The buttons provide easy navigation between\n      the different sheets of this spreadsheet.\n10 - For further instructions see the \"Rigging Plan\",\n     \"Face Block Mount\" and \"Equipment\" tabs."]
[null,"Date: mm/dd",null,null,null,null,null,null,"Company:",null,null,null,null,null,null,null,null,null,{"$f":"VLOOKUP(K19,Equipment!B27:C38,2,FALSE)","v":1000}]
[null,"Client Name:",null,null,null,null,null,null,"Address:",null,null,null,null,null,null,null,null,null,{"$f":"VLOOKUP(K20,Equipment!B27:C38,2,FALSE)","v":1000}]
{"$rows_left_out":47}
{"sheet":"Rigging Plan","index":1,"n_rows":65,"n_cols":20,"rows_kept":65,"cut":false,"hidden":false,"merged":[[42,18,43,18],[0,5,0,9],[1,5,1,9],[2,5,2,9],[3,5,3,9],[4,5,4,9],[10,13,10,14],[21,12,21,13],[20,12,20,14],[17,6,17,7],[16,8,16,9],[17,8,17,9],[15,8,15,9],[5,0,5,6],[42,12,43,12],[42,15,43,15],[42,13,43,13],[42,14,43,14],[42,16,43,16],[42,17,43,17],[19,0,19,9],[20,0,20,1],[41,4,41,5],[5,7,5,9],[18,2,18,3],[16,0,16,2],[17,0,17,2],[15,0,15,2],[9,0,10,1],[12,0,12,1],[10,5,10,6],[11,5,11,6],[10,7,10,9],[11,7,11,9],[16,3,16,5],[17,3,17,5],[16,6,16,7],[10,2,10,4],[11,2,11,4],[9,5,9,6],[9,7,9,9],[9,2,9,4],[12,5,12,6],[11,0,11,1],[12,2,12,4],[12,7,12,9],[14,0,14,2],[15,3,15,5],[6,0,6,9],[7,0,7,1],[8,0,8,1],[7,5,7,6],[8,5,8,6],[7,7,7,9],[8,7,8,9],[7,2,7,4],[8,2,8,4],[24,12,24,13],[12,11,12,12],[29,0,29,3],[58,0,58,9],[44,0,44,1],[44,3,44,4],[44,6,44,8],[46,0,46,9],[45,0,45,1],[45,3,45,4],[45,6,45,8],[30,0,30,9],[35,0,35,1],[32,0,32,1],[36,0,36,1],[37,0,37,1],[35,3,35,4],[36,3,36,4],[37,3,37,4],[35,6,35,8],[36,6,36,8],[37,6,37,8],[43,6,43,8],[47,0,47,1],[59,0,59,9],[51,0,51,9],[52,0,52,1],[53,0,53,1],[52,3,52,4],[53,3,53,4],[52,6,52,8],[53,6,53,8],[56,0,56,9],[57,0,57,9],[54,0,54,9],[55,0,55,9],[21,8,21,9],[31,0,31,1],[47,3,47,4],[48,4,48,5],[48,7,48,9],[29,5,29,6],[29,7,29,8],[22,0,22,9],[23,0,23,3],[23,5,23,8],[47,6,47,8],[33,0,33,1],[40,0,40,9],[38,0,38,1],[43,0,43,1],[43,3,43,4],[13,2,13,3],[14,8,14,9],[14,6,14,7],[14,3,14,5],[15,6,15,7],[21,2,21,3],[25,0,25,3],[24,0,24,3],[38,3,38,4],[38,6,38,8],[28,0,28,3],[26,0,26,3],[24,5,24,8],[25,5,25,8],[26,5,26,8],[18,0,18,1],[18,4,18,9],[21,0,21,1],[20,2,20,4],[20,5,20,7],[21,5,21,7],[20,8,20,9],[33,7,33,8],[31,3,31,5],[29,12,29,13],[29,14,29,15],[29,16,29,17],[30,12,30,13],[30,14,30,15],[30,16,30,17],[0,19,8,21],[61,2,63,7],[61,0,63,1],[61,8,63,9],[0,0,4,4],[32,3,32,5],[33,3,33,5],[32,7,32,8],[31,7,31,8],[39,0,39,1],[39,3,39,4],[39,6,39,8],[60,0,60,9],[41,2,41,3],[34,0,34,9],[49,0,49,9],[50,0,50,9],[42,0,42,9]]}
["Paste Logo\nfrom PowerPoint\nInto this Location",null,null,null,null,{"$f":"'Menu Sheet'!K9","v":0},null,null,null,null,null,null,null,null,null,null,null,null,null,"To put your logo on the Rigging Plan Page, first copy the Logo into PowerPoint.  Press the \"Unlock for Logo Placement\" button.  Then Copy your Logo from PowerPoint and Paste it into the space provided in the Upper Left Corner of this sheet.  Finally, press the \"Relock after Logo Placement\" button."]
[null,null,null,null,null,{"$f":"'Menu Sheet'!K10","v":0}]
[null,null,null,null,null,{"$f":"'Menu Sheet'!K11","v":0}]
[null,null,null,null,null,{"$f":"\"Contact - \"&'Menu Sheet'!K12","v":"Contact - "}]
[null,null,null,null,null,{"$f":"'Menu Sheet'!K13","v":""}]
[{"$f":"\"Rigging Plan No. \"&'Menu Sheet'!K16","v":"Rigging Plan No. "},null,null,null,null,null,null,"Color of All Input Fields"]
["Project Information"]
["Site Name",null,{"$f":"'Menu Sheet'!E12","v":0},null,null,"Date",null,{"$f":"'Menu Sheet'!E9","v":"00:00:00"}]
["Site Number",null,{"$f":"'Menu Sheet'!E13","v":0},null,null,"Customer",null,{"$f":"IF('Menu Sheet'!E10=\"\",\"\",'Menu Sheet'!E10)","v":""},null,null,null,null,null,null,null,"Class I"]
["Site Address",null,{"$f":"'Menu Sheet'!E14","v":0},null,null,"Customer Project #",null,{"$f":"IF('Menu Sheet'!E11=\"\",\"\",'Menu Sheet'!E11)","v":""},null,null,null,null,null,null,null,"Class II"]
{"$rows_left_out":56}
{"sheet":"Site Layout","index":2,"n_rows":0,"n_cols":0,"rows_kept":0,"cut":false,"hidden":true,"merged":[]}

{"sheet":"Type 1","index":3,"n_rows":60,"n_cols":35,"rows_kept":60,"cut":false,"hidden":false,"merged":[[12,6,12,14],[6,17,6,18],[57,1,58,23],[24,9,24,10],[47,27,47,28],[38,2,40,2],[44,12,44,13],[51,21,51,22],[47,21,47,22],[42,21,42,22],[45,12,45,13],[50,11,50,12],[41,15,41,16],[28,13,28,14],[25,9,26,12],[48,27,48,28],[54,1,56,23],[23,16,23,18],[39,7,39,8],[36,12,36,13],[30,14,32,19],[36,15,39,20],[25,16,25,18],[28,11,28,12],[25,22,27,22],[48,11,48,12],[50,17,50,18],[47,18,47,19],[42,8,42,9],[37,12,38,14],[42,19,42,20],[7,6,7,14],[8,6,8,14],[9,6,9,14],[10,6,10,14],[11,6,11,14],[22,14,22,19],[24,14,24,19],[13,16,19,20],[21,14,21,19],[13,6,13,14],[14,6,14,14],[15,6,15,14],[16,6,16,14],[17,6,17,14],[18,6,18,14]]}
[]
[]
[null,"Contact",null,null,"Gordon Lyman",null,null,null,null,null,null,null,null,null,null,null,null,null,null,null,null,null,"Bill Griswold"]
[null,"Email",null,"gl@esystemtraining.com ",null,null,null,null,null,null,null,null,null,null,null,null,null,null,null,null,null,null,"BillGriswold@Live.com"]
[null,"Mobile No",null,null," (210) 410-2091",null,null,null,null,null,null,null,null,"Crown Block Only with Straight Tag",null,null,null,null,null,null,null,null,"(704) 906-9113"]
[]
[null,null,null,null,null,null,"Job Information:",null,null,null,null,null,null,null,null,null,"Note: Fields in ","Blue",null," are for input.",null,null,null,null,null,null,null,null,null,null,null,null,null,null,"Monopole Tower"]
[null,"Date:",null,null,null,null,{"$f":"'Menu Sheet'!E9","v":"00:00:00"},null,null,null,null,null,null,null,null,null,null,null,null,null,null,null,null,null,null,null,null,null,null,null,null,null,null,null,"Self Support Tower"]
[null,"Contractor:",null,null,null,null,{"$f":"'Menu Sheet'!K9","v":0},null,null,null,null,null,null,null,null,null,null,null,null,null,null,null,null,null,null,null,null,null,null,null,null,null,null,null,"Guyed Tower"]
[null,"Job No.:",null,null,null,null,{"$f":"'Menu Sheet'!K15","v":0}]
{"$rows_left_out":51}
{"sheet":"Type 2","index":4,"n_rows":58,"n_cols":23,"rows_kept":58,"cut":false,"hidden":false,"merged":[[7,4,7,7],[8,4,8,7],[9,4,9,7],[10,4,10,7],[11,4,11,7],[55,1,56,11],[49,3,49,7],[23,8,25,8],[21,8,22,8],[26,8,38,8],[37,6,43,7],[24,5,25,6],[42,4,43,5],[44,4,44,7],[52,1,54,11],[17,9,17,11],[17,4,17,6],[22,9,22,11],[8,9,12,11],[41,15,41,16],[12,4,12,7],[13,4,13,7],[14,4,14,7],[15,4,15,7],[16,4,16,7],[4,2,4,4],[4,5,4,8],[3,9,3,11],[4,9,4,11],[0,1,0,7],[1,1,1,7],[2,9,2,11],[2,2,2,4],[3,2,3,4]]}
[]
[]
[null,"Contact","Gordon Lyman",null,null,null,null,null,null,"Bill Griswold"]
[null,"Email","gl@esystemtraining.com ",null,null,null,null,null,null,"BillGriswold@Live.com"]
[null,"Mobile No"," (210) 410-2091",null,null,"Crown Block Only with Trolly System",null,null,null,"(704) 906-9113"]
[]
[null,null,null,null,"Job Information:",null,null,"Note - Fields in ",null,"Blue"," are for input.",null,null,null,null,null,null,null,null,null,null,null,"Monopole Tower"]
[null,"Date:",null,null,{"$f":"'Menu Sheet'!E9","v":"00:00:00"},null,null,null,null,null,null,null,null,null,null,null,null,null,null,null,null,null,"Self Support Tower"]
[null,"Contractor:",null,null,{"$f":"'Menu Sheet'!K9","v":0},null,null,null,null,"Note:  The values for this Lift Type Change with Elevation. \nAll Values Shown are Maximums.",null,null,null,null,null,null,null,null,null,null,null,null,"Guyed Tower"]
[null,"Job No.:",null,null,{"$f":"'Menu Sheet'!K15","v":0}]
{"$rows_left_out":49}
{"sheet":"Type 3","index":5,"n_rows":60,"n_cols":25,"rows_kept":60,"cut":false,"hidden":false,"merged":[[16,4,16,8],[7,4,7,8],[8,4,8,8],[9,4,9,8],[10,4,10,8],[11,4,11,8],[54,1,56,13],[57,1,58,13],[0,1,0,7],[1,1,1,7],[2,2,2,4],[3,2,3,4],[3,11,3,13],[2,11,2,13],[4,11,4,13],[28,10,29,10],[49,12,50,12],[20,11,20,13],[17,8,19,10],[30,6,32,9],[4,2,4,4],[15,4,15,8],[23,4,24,5],[23,11,23,13],[25,11,25,13],[43,12,44,12],[42,4,43,5],[4,5,4,10],[48,8,49,9],[50,8,50,10],[21,11,21,13],[40,7,41,7],[50,6,50,7],[28,6,28,7],[17,4,17,6],[24,6,26,9],[18,4,18,6],[22,5,22,7],[12,4,12,8],[13,4,13,8],[14,4,14,8],[35,11,38,12],[27,6,27,7]]}
[]
[]
[null,"Contact","Gordon Lyman",null,null,null,null,null,null,null,null,"Bill Griswold"]
[null,"Email","gl@esystemtraining.com ",null,null,null,null,null,null,null,null,"BillGriswold@Live.com"]
[null,"Mobile No"," (210) 410-2091",null,null,"Crown and Heel Blocks with Straight Tag",null,null,null,null,null,"(704) 906-9113"]
[]
[null,null,null,null,"Job Information:",null,null,null,"Note: Fields in","Blue","are for input.",null,null,null,null,null,1,null,null,null,null,null,null,null,"Monopole Tower"]
[null,"Date:",null,null,{"$f":"'Menu Sheet'!E9","v":"00:00:00"},null,null,null,null,null,null,null,null,null,null,null,2,null,null,null,null,null,null,null,"Self Support Tower"]
[null,"Contractor:",null,null,{"$f":"'Menu Sheet'!K9","v":0},null,null,null,null,null,null,null,null,null,null,null,3,null,null,null,null,null,null,null,"Guyed Tower"]
[null,"Job No.:",null,null,{"$f":"'Menu Sheet'!K15","v":0}]
{"$rows_left_out":51}
{"sheet":"Angle Chart","index":6,"n_rows":57,"n_cols":25,"rows_kept":57,"cut":false,"hidden":false,"merged":[[0,1,0,7],[1,1,1,7],[2,2,2,4],[2,11,2,13],[3,2,3,4],[3,11,3,13],[12,4,12,6],[12,7,12,11],[13,4,13,6],[4,2,4,4],[4,11,4,13],[7,4,7,6],[8,4,8,6],[9,4,9,6],[10,4,10,6],[11,4,11,6],[4,5,4,9],[14,4,14,6],[54,1,55,13],[13,8,16,11],[24,10,26,10],[51,1,53,13],[24,6,24,7],[22,6,22,7]]}
[]
[]
[null,"Contact","Gordon Lyman",null,null,null,null,null,null,null,null,"Bill Griswold"]
[null,"Email","gl@esystemtraining.com ",null,null,null,null,null,null,null,null,"BillGriswold@Live.com"]
[null,"Mobile No"," (210) 410-2091",null,null,"Angle Finder Tool",null,null,null,null,null,"(704) 906-9113"]
[]
[null,null,null,null,"Job Information:",null,null,null,"Note: Fields in","Blue","are for input.",null,null,null,null,null,null,null,null,null,null,null,null,null,"Monopole Tower"]
[null,"Date:",null,null,{"$f":"'Menu Sheet'!E9","v":"00:00:00"},null,null,null,null,null,null,null,null,null,null,null,null,null,null,null,null,null,null,null,"Self Support Tower"]
[null,"Contractor:",null,null,{"$f":"'Menu Sheet'!K9","v":0},null,null,null,null,null,null,null,null,null,null,null,null,null,null,null,null,null,null,null,"Guyed Tower"]
[null,"Job No.:",null,null,{"$f":"'Menu Sheet'!K15","v":0}]
{"$rows_left_out":48}
{"sheet":"Face Block Mount","index":7,"n_rows":55,"n_cols":28,"rows_kept":55,"cut":false,"hidden":false,"merged":[[26,6,26,12],[27,6,27,12],[0,1,0,13],[1,1,1,13],[2,4,2,6],[20,6,20,12],[21,6,21,12],[3,3,3,7],[2,27,3,27],[18,19,18,21],[17,2,17,22],[10,6,10,12],[11,6,11,12],[12,6,12,12],[13,6,13,12],[15,6,15,12],[21,19,21,21],[23,16,23,23],[24,15,24,23],[22,19,22,21],[2,20,2,23],[3,20,3,23],[27,19,27,21],[18,6,18,12],[2,26,3,26],[13,15,16,23],[25,2,25,22],[19,6,19,12],[9,6,9,12],[14,6,14,12],[4,4,4,6],[4,9,4,16],[4,20,4,23],[7,6,7,12],[8,6,8,12],[26,19,26,21],[19,19,19,21],[20,19,20,21],[52,1,53,23],[49,1,51,23],[28,19,28,21],[29,19,29,21],[31,16,31,23],[32,15,32,23],[28,6,28,12],[29,6,29,12],[30,19,30,21]]}
[]
[]
[null,"Contact",null,null,"Gordon Lyman",null,null,null,null,null,null,null,null,null,null,null,null,null,null,null,"Bill Griswold",null,null,null,null,null,"Crown\nBlock Load","Heel\nBlock Load"]
[null,"Email",null,"gl@esystemtraining.com ",null,null,null,null,null,null,null,null,null,null,null,null,null,null,null,null,"BillGriswold@Live.com",null,null,null,null,"Type"]
[null,"Mobile No",null,null," (210) 410-2091",null,null,null,null,"Face Mounted Crown and Heel Blocks",null,null,null,null,null,null,null,null,null,null,"(704) 906-9113",null,null,null,null,"Type 1",{"$f":"'Type 1'!J25","v":140.90403631180703}]
[null,null,null,null,null,null,null,null,null,null,null,null,null,null,null,null,null,null,null,null,null,null,null,null,null,"Type 2",{"$f":"'Type 2'!G24","v":35.497042130295867}]
[null,null,null,null,null,null,"Job Information:",null,null,null,null,null,null,null,null,null,null,null,null,null,null,null,null,null,null,"Type 3",{"$f":"'Type 3'!F23","v":150.61346752183525},{"$f":"'Type 3'!E49","v":106.51695098578115}]
[null,"Date:",null,null,null,null,{"$f":"'Menu Sheet'!E9","v":"00:00:00"}]
[null,"Contractor:",null,null,null,null,{"$f":"'Menu Sheet'!K9","v":0},null,null,null,null,null,null,null,null,null,null,null,null,null,null,null,null,null,null,{"$f":"'Type 1'!G18","v":"Self Support Tower"}]
[null,"Job No.:",null,null,null,null,{"$f":"'Menu Sheet'!K15","v":0},null,null,null,null,null,null,null,null,null,null,null,null,null,null,null,null,null,null,{"$f":"'Type 2'!E18","v":"Self Support Tower"}]
{"$rows_left_out":46}
{"sheet":"Equipment","index":8,"n_rows":42,"n_cols":25,"rows_kept":42,"cut":false,"hidden":false,"merged":[[22,5,22,6],[22,7,22,8],[22,9,22,10],[17,7,17,8],[21,7,21,8],[21,9,21,10],[19,5,19,6],[18,7,18,8],[18,9,18,10],[39,1,40,11],[10,5,10,6],[10,7,10,8],[10,9,10,10],[11,5,11,6],[11,7,11,8],[19,7,19,8],[19,9,19,10],[20,5,20,6],[20,7,20,8],[20,9,20,10],[17,5,17,6],[22,1,23,3],[11,9,11,10],[12,5,12,6],[12,7,12,8],[0,3,2,8],[6,19,7,19],[6,20,7,20],[6,21,7,21],[2,9,2,11],[3,9,3,11],[4,9,4,11],[3,3,4,8],[10,24,28,29],[9,24,9,29],[8,1,8,3],[24,1,24,3],[23,5,23,6],[9,5,9,6],[9,7,9,8],[9,9,9,10],[8,5,8,10],[12,9,12,10],[23,7,23,8],[23,9,23,10],[16,5,16,6],[16,7,16,8],[16,9,16,10],[21,5,21,6],[6,22,7,22],[17,9,17,10],[18,5,18,6],[13,9,13,10],[14,5,14,6],[14,7,14,8],[14,9,14,10],[15,5,15,6],[15,7,15,8],[15,9,15,10],[13,5,13,6],[13,7,13,8]]}
[null,null,null,"JOINTLY SERVING\nTHE TOWER INDUSTRY\nwith\nTRAINING and ENGINEERING"]
[]
[null,"Contact","Gordon Lyman",null,null,null,null,null,null,"Bill Griswold"]
[null,"Email","gl@esystemtraining.com ","Listing of Contractor's Equipment",null,null,null,null,null,"BillGriswold@Live.com"]
[null,"Mobile No"," (210) 410-2091",null,null,null,null,null,null,"(704) 906-9113"]
[]
[null,null,null,null,null,null,null,null,null,null,null,null,null,null,null,null,null,null,null,"Cable Designation","Safe Working\nLoad","Min. Breaking\nStrength (lbs)","Weight\n(lbs/ft)"]
[]
[null,"HOIST INFORMATION",null,null,null,"SLING INFORMATION",null,null,null,null,null,null,null,null,null,null,null,null,null,"No Cable",0,null,0]
[null,"Hoist Name","Working Capacity (Pounds)","Cable Size and Type",null,"Sling Name",null,"Length (Ft)",null,"Capacity (Pounds)",null,null,null,null,"Hoist Name","Safe\nLoad","Weight\nlbs/ft",null,null,{"$f":"IF('Rope Chart'!B5=\"\",\"\",'Rope Chart'!B5)","v":"1/4\" - 6 x 19"},{"$f":"IF('Rope Chart'!C5=\"\",\"\",'Rope Chart'!C5)","v":1150},{"$f":"IF('Rope Chart'!D5=\"\",\"\",'Rope Chart'!D5)","v":5750},{"$f":"IF('Rope Chart'!E5=\"\",\"\",'Rope Chart'!E5)","v":0.12},{"$f":"IF('Rope Chart'!F5=\"\",\"\",'Rope Chart'!F5)","v":"Wire"},"Directions"]
{"$rows_left_out":33}
{"sheet":"Contacts","index":9,"n_rows":28,"n_cols":7,"rows_kept":28,"cut":false,"hidden":false,"merged":[[1,1,1,3],[13,1,13,3],[25,1,25,3],[13,5,13,7],[1,5,1,6],[17,5,23,6]]}
[]
[null,"Competent Rigger",null,null,null,"Contractor Contact / Project Manager"]
[null,"Name","Company","Phone No.",null,"Name","Phone No."]
[null,"Joe Smith","Rigging, Inc.",2235551234,null,"Daniel Boone",2235551212]
[]
[]
[]
[]
[]
[]
{"$rows_left_out":19}
{"sheet":"Rope Chart","index":10,"n_rows":26,"n_cols":9,"rows_kept":26,"cut":false,"hidden":false,"merged":[[23,0,40,0],[1,5,2,5],[3,8,22,14],[2,8,2,14],[1,1,2,1],[1,2,2,2],[1,3,2,3],[1,4,2,4]]}
[]
[null,"Cable Designation","Safe Working\nLoad","Min. Breaking\nStrength (lbs)","Weight\n(lbs/ft)","Wire/\nSynthetic",null,"Wire"]
[null,null,null,null,null,null,null,"Synthetic","NOTES"]
[null,"No Cable",0,0,0,"Wire",null,null,"The Wire Rope in this chart is based on Independent Wire Rope Core (IWRC) cable with improved plow steel (IPS) and the breaking strength specified is based on catalogue charts which may be lower than the actual specification sheet for a cable. \n\nBoth the Wire and Synthetic Rope values in this chart are based on general nominal values.  We recommend you add your rope values to this chart below based on the manufacturer's specifications.  Rows in White are availble for these additional values.\n\nBe sure and designate either Wire or Synthetic Rope."]
[null,"1/4\" - 6 x 19",1150,5750,0.12,"Wire"]
[null,"5/16\" - 6 x 19",1750,8750,0.18,"Wire"]
[null,"3/8\" - 6 x 19",2550,11250,0.26,"Wire"]
[null,"7/16\" - 6 x 19",3450,17250,0.35,"Wire"]
[null,"1/2\" - 6 x 19",4700,23500,0.46,"Wire"]
[null,"9/16\" - 6 x 19",5700,28500,0.59,"Wire"]
{"$rows_left_out":17}
{"sheet":"Extra Sequence Sheet","index":11,"n_rows":5,"n_cols":1,"rows_kept":5,"cut":false,"hidden":false,"merged":[[1,0,1,9],[2,0,2,9],[3,0,3,9],[0,0,0,9]]}
["Continuation of Description of Work Sequence "]
[]
["Continuation of Description of  Reinforcing Sequence"]
[]
[{"$f":"Credits!B11","v":"Version 5.6 - February 19, 2019"}]

{"sheet":"Rigging requirements","index":12,"n_rows":0,"n_cols":0,"rows_kept":0,"cut":false,"hidden":false,"merged":[]}

{"sheet":"Credits","index":13,"n_rows":23,"n_cols":2,"rows_kept":23,"cut":false,"hidden":false,"merged":[[10,1,10,3]]}
[]
["The Equation Development, Drafting and Primary Spreadsheet by William A. Griswold, Jr., PE "]
["Griswold Tower Software, PC"]
[]
["Overview and Editing provided by Gordon Lyman"]
["eSystem Training Solutions"]
[]
["Additional Macro Development provided by James M. Ruedlinger, PE"]
["Electronic Research, Inc."]
[]
{"$rows_left_out":14}
{"sheet":"Sheet2","index":14,"n_rows":7,"n_cols":10,"rows_kept":7,"cut":false,"hidden":true,"merged":[[1,2,36,4]]}
[]
[null,null,{"$f":"IF(J7=\"Monopole Tower\",\"MP_PIC\",1)","v":"MP_PIC"}]
[null,null,null,null,null,null,null,null,null,"Monopole Tower"]
[null,null,null,null,null,null,null,null,null,"Self Support Tower"]
[null,null,null,null,null,null,null,null,null,"Guyed Tower"]
[]
[null,null,null,null,null,null,null,null,null,"Monopole Tower"]

{"sheet":"Sheet1","index":15,"n_rows":16,"n_cols":8,"rows_kept":16,"cut":false,"hidden":true,"merged":[]}
[]
[]
[]
[null,null,null,null,null,null,"X1","Y2"]
[null,"Alpha = ",7,null,null,null,2E-3,100]
[null,"Beta =",30,null,null,null,2.476,90]
[null,"Load =",300,null,null,null,5.2160000000000002,80]
[null,null,null,null,null,null,8.2650000000000006,70]
[null,"tan(Alpha) = ",{"$f":"TAN(C5*PI()/180)","v":0.1227845609029046},null,null,null,11.683999999999999,60]
[null,"tan(Alpha/2) =",{"$f":"TAN(C5*PI()/360)","v":6.1162620150484306E-2},null,null,null,15.555999999999999,50]
{"$rows_left_out":6}